Config
Log for #openttdcoop.devzone on 2nd September 2013:
Times are UTC Toggle Colours
02:55:53  *** Supercheese has quit IRC
03:00:40  *** Supercheese has joined #openttdcoop.devzone
06:47:46  *** andythenorth has joined #openttdcoop.devzone
06:50:19  *** andythenorth has quit IRC
07:20:29  *** andythenorth has joined #openttdcoop.devzone
07:40:26  *** andythenorth has left #openttdcoop.devzone
08:16:08  *** Supercheese has quit IRC
08:19:44  *** oskari89 has joined #openttdcoop.devzone
09:00:22  <Brot6> xussrset: update from r1082 to r1083 done (4 warnings) - http://bundles.openttdcoop.org/xussrset/push/r1083
09:36:34  *** zooks has joined #openttdcoop.devzone
09:37:09  <Brot6> Membership #6324 (New): Applying for project: FakeBridge XzooksX @ http://dev.openttdcoop.org/issues/6324
10:11:55  <Brot6> Revision 271:32fc51227161: Fix: Refits made more accurate Xjuzza1X @ http://dev.openttdcoop.org/projects/finnishtrainset/repository/revisions/32fc51227161
10:11:55  <Brot6> Revision 272:8b544a8a0421: Fix: E and P sorting Xjuzza1X @ http://dev.openttdcoop.org/projects/finnishtrainset/repository/revisions/8b544a8a0421
10:33:50  <Brot6> xussrset: update from r1083 to r1084 done (4 warnings) - http://bundles.openttdcoop.org/xussrset/push/r1084
10:34:11  *** zooks has quit IRC
10:49:04  <Brot6> repository /home/hg/fake-bridges registered in Redmine with url /home/hg/fake-bridges
10:49:04  <Brot6> repository /home/hg/fake-bridges created
10:58:34  <Brot6> Membership #6324 (Feedback): Applying for project: FakeBridge XzooksX @ http://dev.openttdcoop.org/issues/6324
10:58:34  <Brot6> Membership #6324 (Feedback): Applying for project: FakeBridge XplanetmakerX @ http://dev.openttdcoop.org/issues/6324#change-17235
11:35:09  *** zooks has joined #openttdcoop.devzone
12:10:06  *** zooks has quit IRC
12:21:57  *** zooks has joined #openttdcoop.devzone
13:36:12  *** zooks has quit IRC
14:14:50  <Brot6> Feature #6325 (New): Suitable wagons modified from 2cc set ones Xkyosuke1989X @ http://dev.openttdcoop.org/issues/6325
15:02:56  *** ODM has joined #openttdcoop.devzone
15:25:52  <DevZone> Project eints-test build #37: SUCCESS in 2 min 33 sec: https://jenkins.openttdcoop.org/job/eints-test/37/
15:49:48  <Brot6> Revision 273:23d39cffd7aa: Fix: B1 pässi flippable Xjuzza1X @ http://dev.openttdcoop.org/projects/finnishtrainset/repository/revisions/23d39cffd7aa
16:21:00  <Brot6> Feature #4679: Some sprites to be done Xkyosuke1989X @ http://dev.openttdcoop.org/issues/4679#change-17236
17:05:23  *** Alberth has joined #openttdcoop.devzone
17:18:18  *** Jam35 has joined #openttdcoop.devzone
17:18:53  <DevZone> Project NML - NewGRF Meta Language build #30: SUCCESS in 22 sec: https://jenkins.openttdcoop.org/job/nml/30/
17:23:15  <Brot6> xussrset: update from r1082 to r1084 done (4 warnings) - http://bundles.openttdcoop.org/xussrset/nightlies/r1084
17:23:21  *** Jam35_ has joined #openttdcoop.devzone
17:25:11  *** Jam35_ has joined #openttdcoop.devzone
17:26:21  *** Jam35 has quit IRC
17:29:44  <Brot6> finnishtrainset: update from r264 to r273 done - http://bundles.openttdcoop.org/finnishtrainset/nightlies/r273
17:42:04  <Brot6> firs: update from r3820 to r3825 done (26 warnings) - http://bundles.openttdcoop.org/firs/nightlies/r3825
17:42:14  *** frosch123 has joined #openttdcoop.devzone
17:53:19  <Brot6> eints-test: update from r3788 to r3789 done (30 warnings) - http://bundles.openttdcoop.org/eints-test/nightlies/r3789
18:04:24  <Brot6> Revision 183:a26515d05515: Add: changeset hook to trigger jenkins builds for each new changeset g... XplanetmakerX @ http://dev.openttdcoop.org/projects/home/repository/revisions/a26515d05515
18:07:00  *** gelignite has joined #openttdcoop.devzone
18:08:05  <Brot6> Revision 184:d4d581021f14: Fix (183:a26515d05515): mis-placed --user definition XplanetmakerX @ http://dev.openttdcoop.org/projects/home/repository/revisions/d4d581021f14
18:12:46  <Brot6> Revision 185:29cc6afbebdd: Fix: Remove some debug output XplanetmakerX @ http://dev.openttdcoop.org/projects/home/repository/revisions/29cc6afbebdd
18:17:14  <Brot6> eints-test: compile of 1.2.1 failed - http://bundles.openttdcoop.org/eints-test/releases/ERROR/1.2.1
18:17:35  <planetmaker> he. brot has a lot to compile now :D
18:17:52  <Alberth> maybe he will grow to Brot7 :p
18:20:20  <^Spike^> ...
18:20:38  <DevZone> Project FIRS Industrial Replacement Set build #29: SUCCESS in 2 min 8 sec: https://jenkins.openttdcoop.org/job/firs/29/
18:21:15  <Alberth> you don't want your bots to grow up to good, hard working computers?
18:23:20  <planetmaker> :D
18:24:58  <Brot6> eints-test: compile of 1.2.3 failed - http://bundles.openttdcoop.org/eints-test/releases/ERROR/1.2.3
18:33:54  *** Supercheese has joined #openttdcoop.devzone
18:42:59  <DevZone> Project eints-test build #38: FAILURE in 29 sec: https://jenkins.openttdcoop.org/job/eints-test/38/
18:43:24  <DevZone> Project eints-test build #39: STILL FAILING in 24 sec: https://jenkins.openttdcoop.org/job/eints-test/39/
18:48:22  <frosch123> i keep on reading those jenkins messages in future tense
18:48:33  <frosch123> "immenent failure in 29 seconds incoming"
18:49:13  <^Spike^> lol
18:49:22  <frosch123> are those build-in messages?
18:49:30  <^Spike^> as far as i found out... yes
18:49:32  <frosch123> if they are custom i would suggest to replace the "in" with "after"
18:50:04  <frosch123> but well, don't put any work into it :p
18:52:07  <^Spike^> already searched through the source cause we wanted the commands to be op only :)
19:40:26  *** ODM has quit IRC
20:43:41  <DevZone> Yippie, build fixed!
20:43:42  <DevZone> Project eints-test build #40: FIXED in 2 min 34 sec: https://jenkins.openttdcoop.org/job/eints-test/40/
20:44:18  <^Spike^> i like how it goes Yippie! D
20:44:20  <^Spike^> :D
20:44:26  <planetmaker> :-)
20:46:05  <DevZone> Project eints-test build #41: SUCCESS in 2 min 24 sec: https://jenkins.openttdcoop.org/job/eints-test/41/
20:46:48  *** frosch123 has quit IRC
20:47:25  <TWerkhoven> devzone is a happy bot
20:47:30  <^Spike^> :)
20:48:03  <Alberth> it gets a bit tiresome
20:48:14  <TWerkhoven> it can be changed
20:48:14  <Brot6> Revision 186:4237963961fb: Fix: remove some quotes XplanetmakerX @ http://dev.openttdcoop.org/projects/home/repository/revisions/4237963961fb
20:54:49  <DevZone> Project eints-test build #42: FAILURE in 33 sec: https://jenkins.openttdcoop.org/job/eints-test/42/
20:56:08  <planetmaker> :S
20:57:01  <planetmaker> this happyness is the default config of jenkin's IRC plug-in
20:57:09  <planetmaker> not sure how much it can be customized ;-)
20:57:21  <TWerkhoven> irc plugin is just a target for the im plugin
20:57:29  <TWerkhoven> the im plugin defines the messages
20:57:44  <planetmaker> which is also mediocre configurable ;-)
20:57:48  <^Spike^> we already looked into changing messages of the IM plugin
20:57:53  <^Spike^> just couldn't find it
20:58:23  <Alberth> ugh plugins in plugins?
20:58:42  <TWerkhoven> messages.properties?
20:58:55  <TWerkhoven> contains 3 lines, each one message
20:59:14  <^Spike^> hmmmm
20:59:18  <TWerkhoven> instant-messaging-plugin / src / main / resources / hudson / plugins / im / build_notify / Messages.properties
20:59:23  <^Spike^> that's not a location to look at... ;)
20:59:30  <^Spike^> does it mean recompiling? :D
20:59:58  <TWerkhoven> not a clue, i just happened to be curious
21:00:08  <^Spike^> seems so... :/
21:03:11  <^Spike^> if we want to change that it would mean recompiling on every update :/
21:04:11  <Alberth> set up Jenkins to do that :p
21:04:23  <TWerkhoven> lol
21:04:23  <planetmaker> :D
21:04:37  <^Spike^> :)
21:04:43  <Alberth> good night
21:04:50  <TWerkhoven> gnite alberth
21:04:56  <planetmaker> nite, Alberth
21:04:56  <^Spike^> cya Alberth
21:05:01  *** Alberth has left #openttdcoop.devzone
21:05:21  <^Spike^> if we did that... it would be fun.... installing all the java compiling crap :D
21:05:33  <Brot6> Revision 29:4758f1f34eb3: no need to store values twice XT. WerkhovenX @ http://dev.openttdcoop.org/projects/soap/repository/revisions/4758f1f34eb3
21:05:33  <Brot6> Revision 30:2ab8b49fcae0: make better use of events XT. WerkhovenX @ http://dev.openttdcoop.org/projects/soap/repository/revisions/2ab8b49fcae0
21:05:33  <Brot6> Revision 31:357ca26e8447: Ding command XT. WerkhovenX @ http://dev.openttdcoop.org/projects/soap/repository/revisions/357ca26e8447
21:07:04  <TWerkhoven> and with that, i bid you goondnight as well
21:07:53  <^Spike^> cya
21:08:20  <planetmaker> good night, TWerkhoven
21:13:40  <DevZone> Project eints-test build #43: STILL FAILING in 36 sec: https://jenkins.openttdcoop.org/job/eints-test/43/
21:16:15  <DevZone> Project eints-test build #44: STILL FAILING in 26 sec: https://jenkins.openttdcoop.org/job/eints-test/44/
21:16:24  <planetmaker> :D
21:18:32  <^Spike^> bc command not found...
21:18:36  <^Spike^> might that be the issue? :)
21:18:47  <planetmaker> yes... but I don't know where that comes from :D
21:18:55  <^Spike^> debian right?
21:19:11  <planetmaker> from the Makefile. I actually... have a clue
21:20:54  <^Spike^> got it yet?
21:21:07  <planetmaker> not installed on jenkins :-)
21:21:38  <^Spike^> apt-get install bc? :)
21:21:42  <planetmaker> ^^
21:21:42  <^Spike^> bc: /usr/bin/bc
21:21:55  <^Spike^> apt-file is a nice to have on debian servers i just realised ;)
21:22:19  <^Spike^> yum just has provides :D
21:22:42  <planetmaker> apt-file?
21:23:05  <^Spike^> apt-file allohttp://www.cyberciti.biz/faq/equivalent-of-rpm-qf-command/
21:23:06  <Webster> Title: Debian / Ubuntu Linux: Find Out What Package Provides a File (at www.cyberciti.biz)
21:23:08  <^Spike^> bleh
21:23:08  <^Spike^> http://www.cyberciti.biz/faq/equivalent-of-rpm-qf-command/
21:23:11  <^Spike^> at the bottom there
21:23:24  <^Spike^> apt-file allows search for files in packages in repos
21:25:40  <planetmaker> hm, now I know why it started failing... I committed Makefile changes... which I didn't exactly mean to commit yet :D
21:25:47  <DevZone> Yippie, build fixed!
21:25:47  <DevZone> Project eints-test build #45: FIXED in 3 min 22 sec: https://jenkins.openttdcoop.org/job/eints-test/45/
21:26:46  <^Spike^> :D
21:26:48  <planetmaker> and bc is not a shell-built-in
21:27:39  *** gelignite has quit IRC
21:30:26  *** Jam35_ has quit IRC
21:41:20  <DevZone> Project eints-test build #46: SUCCESS in 4 min 10 sec: https://jenkins.openttdcoop.org/job/eints-test/46/
21:41:25  <DevZone> Project eints-test build #47: FAILURE in 5.3 sec: https://jenkins.openttdcoop.org/job/eints-test/47/
21:44:52  <Brot6> Revision 187:b315953fc1dc: Fix: URL to jenkins and some general doc and cleanup XplanetmakerX @ http://dev.openttdcoop.org/projects/home/repository/revisions/b315953fc1dc
21:46:46  <DevZone> Yippie, build fixed!
21:46:47  <DevZone> Project eints-test build #48: FIXED in 3 min 5 sec: https://jenkins.openttdcoop.org/job/eints-test/48/
21:46:49  <DevZone> Project eints-test build #49: FAILURE in 3.8 sec: https://jenkins.openttdcoop.org/job/eints-test/49/
21:47:47  <Brot6> eints-test: compile of 1.2.4 failed - http://bundles.openttdcoop.org/eints-test/releases/ERROR/1.2.4
21:58:13  <DevZone> Yippie, build fixed!
21:58:13  <DevZone> Project eints-test build #50: FIXED in 4 min 32 sec: https://jenkins.openttdcoop.org/job/eints-test/50/
22:06:15  <Brot6> eints-test: compile of 1.2.5 failed - http://bundles.openttdcoop.org/eints-test/releases/ERROR/1.2.5
22:07:11  <DevZone> Project eints-test build #51: SUCCESS in 3 min 53 sec: https://jenkins.openttdcoop.org/job/eints-test/51/
22:07:25  <^Spike^> old compile farm fails where new one succeeds? :)
22:07:39  <planetmaker> yeah... possibly lack of bc :-P
22:07:43  <^Spike^> :)
22:08:01  <^Spike^> but i thought osc could install on the fly what it needed? :D
22:08:19  <planetmaker> yeah. If you tell it that it's needed. I don't
22:15:23  <^Spike^> :)
22:15:33  * ^Spike^ got A graylog server up...
22:15:40  <^Spike^> looks nice... now to get the rest going.. :D
22:15:42  <planetmaker> :-)
22:18:41  <DevZone> Project eints-test build #52: SUCCESS in 4 min 15 sec: https://jenkins.openttdcoop.org/job/eints-test/52/
22:21:52  <planetmaker> hm..., ^Spike^: 7 17 * * * su - hg /home/hg/misc/compiler/wrapper/scheduler.tools.sh 1>/dev/null
22:22:03  <planetmaker> err-no-such-file :D
22:23:55  <Brot6> eints-test: compile of 1.2.6 failed - http://bundles.openttdcoop.org/eints-test/releases/ERROR/1.2.6
22:24:08  <^Spike^> :)
22:24:16  * ^Spike^ just copied it :D
22:25:07  <DevZone> Project eints-test build #53: SUCCESS in 4 min 15 sec: https://jenkins.openttdcoop.org/job/eints-test/53/
22:25:57  <planetmaker> I wonder what it did
22:30:37  <planetmaker> something to worry about another day, though. Good night :-)
22:31:44  <^Spike^> :)
22:31:53  <^Spike^> i just got me logserver up and you go away! :)
22:32:27  <planetmaker> :D
22:35:03  <^Spike^> whie... :)
22:36:10  <planetmaker> so where is it?
22:40:14  <^Spike^> see other universe
22:40:19  <^Spike^> sorry was looking @ expansions :D
23:41:05  *** oskari89 has quit IRC

Powered by YARRSTE version: svn-trunk